{"text_format":"1","workbook":"xlsx","n_sheets":5,"sheets":["Drawing","Machine Parameters","revisions","Lookup Tables","Reference Table"],"not_rendered":{"charts":0,"images":3,"macros":1,"external_links":1,"defined_names":351,"comments":0,"pivot_tables":0},"unopened":[],"bounds":{"document_bytes":16777216,"sheet_cells":100000,"rows_first":2000,"rows_last":500,"rows_between":2000,"halvings":0,"cell_chars":16384,"cell_head_chars":4096},"cells_cut":0,"cells_raw":0,"read":"whole","date_system":"1900"}

{"sheet":"Drawing","index":0,"n_rows":135,"n_cols":78,"rows_kept":135,"cut":false,"hidden":false,"merged":[[1,3,1,4],[131,14,131,15],[134,14,134,15],[19,22,19,23],[19,27,19,30],[130,7,130,9],[65,14,65,15],[20,0,20,15],[67,14,67,15],[65,3,65,12],[66,3,66,12],[67,3,67,12],[68,3,68,12],[133,14,133,15],[132,14,132,15],[66,14,66,15],[68,14,68,15],[6,17,14,17],[7,10,7,12],[8,10,8,12],[9,10,9,12],[0,16,5,16],[6,16,15,16],[12,6,18,14],[2,10,2,12],[3,10,3,12],[4,10,4,12],[5,10,5,12],[6,10,6,12],[0,3,0,5],[69,0,69,1],[70,0,70,1],[64,7,64,9],[11,8,11,14],[2,3,2,4],[3,3,3,4],[4,3,4,4],[5,3,5,4],[6,3,6,4],[7,3,7,4],[8,3,8,4],[9,3,9,4],[10,3,10,4],[16,3,16,4],[18,1,18,2],[18,3,18,4],[17,3,17,4],[11,3,11,4],[12,3,12,4],[13,3,13,4],[14,3,14,4],[15,3,15,4]]}
[null,"Product Code",null,{"$f":"'Reference Table'!G29","v":{"$error":"#N/A"}},null,null,null,null,null,null,null,null,null,null,null,null,"Drawing #",null,null,"TOP GROUND",42,"GL",{"$f":"(D4-H5)*12","v":{"$error":"#N/A"}},null,null,null,null,null,null,null,null,null,null,null,null,null,null,null,null,null,null,null,null,null,null,null,null,null,null,null,null,null,null,null,null,null,null,null,null,null,null,null,null,null,null,null,null,null,null,null,null,null,null,null,null,null,{"$f":"'Machine Parameters'!B19","v":3},"Top"]
[null,null,null,null,null,null,null,null,null,null,null,null,null,null,null,null,null,null,null,"BOTTOM GROUND",{"$f":"((D4-H5)*12)-14","v":{"$error":"#N/A"}},null,null,null,null,null,null,null,null,null,null,null,null,null,null,null,null,null,null,null,null,null,null,null,null,null,null,null,null,null,null,null,null,null,null,null,null,null,null,null,null,null,null,null,null,null,null,null,null,null,null,null,null,null,null,null,{"$f":"'Machine Parameters'!B20","v":4.3499999999999996},"Bottom"]
[null,"Pole Quantity:  ",null,null,null,null,null,null,null,"S/N","TBD",null,null,null,null,null,null,null,null,null,null,null,null,null,null,null,null,null,null,null,null,null,null,null,null,null,null,null,null,null,null,null,null,null,null,null,null,null,null,null,null,null,null,null,null,null,null,null,null,null,null,null,null,null,null,null,null,null,null,null,null,null,null,null,null,null,{"$f":"'Machine Parameters'!B21","v":5.6749999999999998}]
[null,"Length (ft):",null,null,null,null,null,null,null,"STR #","N/A"]
[null,"Class:",null,null,null,"Groundline",null,{"$f":"VLOOKUP(D4,'Lookup Tables'!B10:C26,2,FALSE)","v":{"$error":"#N/A"}},null,"HEIGHT",{"$f":"(D4)&\"  ft.\"","v":"  ft."}]
[null,"Finish Coating:  ",null,null,null,"Standard Embed Coating:",null,{"$f":"VLOOKUP(D4,'Lookup Tables'!B10:C26,2)+1","v":{"$error":"#N/A"}},null,"CLASS",{"$f":"D5","v":0}]
[null,"Total Embed Coating",null,{"$f":"H6+H7","v":{"$error":"#N/A"}},null,"Extra Feet of Embed Coating: ",null,null,null,"WEIGHT",{"$f":"VLOOKUP(D5&D4,'[1]Final Wgt Calcs'!$A$3:$AM$188,39,FALSE)","v":{"$error":"#N/A"}},null,null,null,null,null,null,"T 7-15"]
[null,"Total Holes:  ",null,{"$f":"SUM('Lookup Tables'!H4:H371)","v":0},null,null,null,null,null,"MFG. DATE","TBD"]
[null,"Ground Plates:",null,null,null,null,null,null,null,"CUSTOMER "]
[null,"Tapped Grounding Holes:",null,{"$f":"SUM('Lookup Tables'!$P$3,'Lookup Tables'!Z3,'Lookup Tables'!AE3)","v":0},null,null,null,null,null,"CAPACITY",{"$f":"ROUNDUP(((VLOOKUP(D5,'Lookup Tables'!B29:C44,2,))*(1)/1000),2)&\"  kips\"","v":{"$error":"#N/A"}}]
{"$rows_left_out":126}
{"sheet":"Machine Parameters","index":1,"n_rows":56,"n_cols":17,"rows_kept":56,"cut":false,"hidden":false,"merged":[]}
["Tool #","Type","Dia (inches)","Speed RPM","Feedrate (in/min)","Thread Pitch (inches)","Cutting Speed (RPM)","Pilot Size (inches)",null,null,null,null,null,null,null,"Alpha to Numeric Lookup Table"]
["T1","D","7/32\"","S3500","F24",null,null,null,null,null,null,null,null,null,null,"Quadrant","Angle"]
["T2","D","19/32\"","S1950","F19.5",null,null,null,null,null,null,null,null,null,null,"A",315]
["T3","D","11/16\"","S1600","F21",null,null,null,null,null,null,null,null,null,null,"B",0]
["T4","D","5/8\"","S1760","F22.8",null,null,null,null,null,null,null,null,null,null,"C",45]
["T5","D","13/16\"","S1350","F17.6",null,null,null,null,null,null,null,null,null,null,"D",90]
["T6","D","27/64\"","S1680","F20",null,null,null,null,null,null,null,null,null,null,"E",135]
["T7","D","1\"","S1100","F14.3",null,null,null,null,null,null,null,null,null,null,"F",180]
["T8","D","1-1/2\"","S750","F9.5",null,null,null,null,null,null,null,null,null,null,"G",225]
[null,null,null,null,null,null,null,null,null,null,null,null,null,null,null,"H",270]
{"$rows_left_out":47}
{"sheet":"revisions","index":2,"n_rows":22,"n_cols":5,"rows_kept":22,"cut":false,"hidden":false,"merged":[[21,1,22,6],[18,1,19,6],[16,1,16,6],[0,0,2,6],[9,1,9,6],[12,1,12,6],[14,1,14,4]]}
["9/14/17\nNOTE 9:   YES - Two 11/16\" through bolt holes located 4\" from female joint lip on B-F axis (insert 5/8\" bolt  XX\" long)\nFour 11/16\" jacking lug holes located 48\" from field assembly joint on D-H axis  TOP HALF: SECT 2-4  /  BOTTOM HALF: SECT 5-6"]
[]
[]
["4' from base of top",null,null,"D","H"]
["4' from tip of bottom",null,null,"D","H"]
[]
["9/21/17\n","1. SS rivet nuts – 5/8”"]
[null,"2. All ground plate holes for all customers – 27/64” tapped holes"]
[]
["2017-09-28","Per Warren Stewart and Jim Hinkel - All grounds will be tapped holes "]
{"$rows_left_out":13}
{"sheet":"Lookup Tables","index":3,"n_rows":371,"n_cols":36,"rows_kept":371,"cut":false,"hidden":false,"merged":[[2,37,2,39],[2,12,2,14],[2,17,2,19],[2,22,2,24],[2,27,2,29],[2,32,2,34]]}
[]
[]
[null,"Coating","Code",null,"Cap","Code",null,"Count","Position",null,"Details List",null,{"$f":"'Lookup Tables'!$K$6","v":"1/2\" TAP (Ground)"},null,null,{"$f":"SUM(M5:P59)","v":0},null,{"$f":"'Lookup Tables'!$K$9","v":"JACKING HOLE"},null,null,{"$f":"SUM(R5:U59)","v":0},null,{"$f":"'Lookup Tables'!$K$12","v":"CANT HOLE"},null,null,{"$f":"SUM(W5:Z59)","v":0},null,{"$f":"'Lookup Tables'!$K$11","v":"STEP HOLE"},null,null,{"$f":"SUM(AB5:AE59)","v":0},null,"1/2\" SS RIVNUT",null,null,{"$f":"SUM(AG5:AJ59)","v":0}]
[null,"W","Weathered",null,"C","Flat",null,{"$f":"COUNTIF(Drawing!$D$25:$E$65,I4)+COUNTIF(Drawing!$N$25:$O$65,I4)+COUNTIF(Drawing!$D$77:$E$131,I4)+COUNTIF(Drawing!$N$77:$O$131,I4)","v":0},"A",null,"THRU HOLE",null,"T1","T2","T3","T4",null,"T1","T2","T3","T4",null,"T1","T2","T3","T4",null,"T1","T2","T3","T4",null,"T1","T2","T3","T4"]
[null,"G","Gray",null,"R","Raptor",null,{"$f":"COUNTIF(Drawing!$D$25:$E$65,I5)+COUNTIF(Drawing!$N$25:$O$65,I5)+COUNTIF(Drawing!$D$77:$E$131,I5)+COUNTIF(Drawing!$N$77:$O$131,I5)","v":0},"B",null,"PIN JOINT",null,{"$f":"IF(Drawing!$G25='Lookup Tables'!$M$3,COUNTA(Drawing!$D25:$E25),\"-\")","v":"-"},{"$f":"IF(Drawing!$Q25='Lookup Tables'!$M$3,COUNTA(Drawing!$N25:$O25),\"-\")","v":"-"},{"$f":"IF(Drawing!$G77='Lookup Tables'!$M$3,COUNTA(Drawing!$D77:$E77),\"-\")","v":"-"},{"$f":"IF(Drawing!$Q77='Lookup Tables'!$M$3,COUNTA(Drawing!$N77:$O77),\"-\")","v":"-"},null,{"$f":"IF(Drawing!$G25='Lookup Tables'!$R$3,COUNTA(Drawing!$D25:$E25),\"-\")","v":"-"},{"$f":"IF(Drawing!$Q25='Lookup Tables'!$R$3,COUNTA(Drawing!$N25:$O25),\"-\")","v":"-"},{"$f":"IF(Drawing!$G77='Lookup Tables'!$R$3,COUNTA(Drawing!$D77:$E77),\"-\")","v":"-"},{"$f":"IF(Drawing!$Q77='Lookup Tables'!$R$3,COUNTA(Drawing!$N77:$O77),\"-\")","v":"-"},null,{"$f":"IF(Drawing!$G25='Lookup Tables'!$K$12,COUNTA(Drawing!$D25:$E25),\"-\")","v":"-"},{"$f":"IF(Drawing!$Q25='Lookup Tables'!$K$12,COUNTA(Drawing!$N25:$O25),\"-\")","v":"-"},{"$f":"IF(Drawing!$G77='Lookup Tables'!$K$12,COUNTA(Drawing!$D77:$E77),\"-\")","v":"-"},{"$f":"IF(Drawing!$Q77='Lookup Tables'!$K$12,COUNTA(Drawing!$N77:$O77),\"-\")","v":"-"},null,{"$f":"IF(Drawing!$G25='Lookup Tables'!$K$11,COUNTA(Drawing!$D25:$E25),\"-\")","v":"-"},{"$f":"IF(Drawing!$Q25='Lookup Tables'!$K$11,COUNTA(Drawing!$N25:$O25),\"-\")","v":"-"},{"$f":"IF(Drawing!$G77='Lookup Tables'!$K$11,COUNTA(Drawing!$D77:$E77),\"-\")","v":"-"},{"$f":"IF(Drawing!$Q77='Lookup Tables'!$K$11,COUNTA(Drawing!$N77:$O77),\"-\")","v":"-"},null,{"$f":"IF(Drawing!$G25='Lookup Tables'!$K$20,COUNTA(Drawing!$D25:$E25),\"-\")","v":"-"},{"$f":"IF(Drawing!$Q25='Lookup Tables'!$K$20,COUNTA(Drawing!$N25:$O25),\"-\")","v":"-"},{"$f":"IF(Drawing!$G77='Lookup Tables'!$K$20,COUNTA(Drawing!$D77:$E77),\"-\")","v":"-"},{"$f":"IF(Drawing!$Q77='Lookup Tables'!$K$20,COUNTA(Drawing!$N77:$O77),\"-\")","v":"-"}]
[null,"C","Custom Color",null,"D","Ductile",null,{"$f":"COUNTIF(Drawing!$D$25:$E$65,I6)+COUNTIF(Drawing!$N$25:$O$65,I6)+COUNTIF(Drawing!$D$77:$E$131,I6)+COUNTIF(Drawing!$N$77:$O$131,I6)","v":0},"C",null,"1/2\" TAP (Ground)",null,{"$f":"IF(Drawing!$G26='Lookup Tables'!$M$3,COUNTA(Drawing!$D26:$E26),\"-\")","v":"-"},{"$f":"IF(Drawing!$Q26='Lookup Tables'!$M$3,COUNTA(Drawing!$N26:$O26),\"-\")","v":"-"},{"$f":"IF(Drawing!$G78='Lookup Tables'!$M$3,COUNTA(Drawing!$D78:$E78),\"-\")","v":"-"},{"$f":"IF(Drawing!$Q78='Lookup Tables'!$M$3,COUNTA(Drawing!$N78:$O78),\"-\")","v":"-"},null,{"$f":"IF(Drawing!$G26='Lookup Tables'!$R$3,COUNTA(Drawing!$D26:$E26),\"-\")","v":"-"},{"$f":"IF(Drawing!$Q26='Lookup Tables'!$R$3,COUNTA(Drawing!$N26:$O26),\"-\")","v":"-"},{"$f":"IF(Drawing!$G78='Lookup Tables'!$R$3,COUNTA(Drawing!$D78:$E78),\"-\")","v":"-"},{"$f":"IF(Drawing!$Q78='Lookup Tables'!$R$3,COUNTA(Drawing!$N78:$O78),\"-\")","v":"-"},null,{"$f":"IF(Drawing!$G26='Lookup Tables'!$K$12,COUNTA(Drawing!$D26:$E26),\"-\")","v":"-"},{"$f":"IF(Drawing!$Q26='Lookup Tables'!$K$12,COUNTA(Drawing!$N26:$O26),\"-\")","v":"-"},{"$f":"IF(Drawing!$G78='Lookup Tables'!$K$12,COUNTA(Drawing!$D78:$E78),\"-\")","v":"-"},{"$f":"IF(Drawing!$Q78='Lookup Tables'!$K$12,COUNTA(Drawing!$N78:$O78),\"-\")","v":"-"},null,{"$f":"IF(Drawing!$G26='Lookup Tables'!$K$11,COUNTA(Drawing!$D26:$E26),\"-\")","v":"-"},{"$f":"IF(Drawing!$Q26='Lookup Tables'!$K$11,COUNTA(Drawing!$N26:$O26),\"-\")","v":"-"},{"$f":"IF(Drawing!$G78='Lookup Tables'!$K$11,COUNTA(Drawing!$D78:$E78),\"-\")","v":"-"},{"$f":"IF(Drawing!$Q78='Lookup Tables'!$K$11,COUNTA(Drawing!$N78:$O78),\"-\")","v":"-"},null,{"$f":"IF(Drawing!$G26='Lookup Tables'!$K$20,COUNTA(Drawing!$D26:$E26),\"-\")","v":"-"},{"$f":"IF(Drawing!$Q26='Lookup Tables'!$K$20,COUNTA(Drawing!$N26:$O26),\"-\")","v":"-"},{"$f":"IF(Drawing!$G78='Lookup Tables'!$K$20,COUNTA(Drawing!$D78:$E78),\"-\")","v":"-"},{"$f":"IF(Drawing!$Q78='Lookup Tables'!$K$20,COUNTA(Drawing!$N78:$O78),\"-\")","v":"-"}]
[null,"X","Extreme Coat",null,null,null,null,{"$f":"COUNTIF(Drawing!$D$25:$E$65,I7)+COUNTIF(Drawing!$N$25:$O$65,I7)+COUNTIF(Drawing!$D$77:$E$131,I7)+COUNTIF(Drawing!$N$77:$O$131,I7)","v":0},"D",null,"FIELD JOINT",null,{"$f":"IF(Drawing!$G27='Lookup Tables'!$M$3,COUNTA(Drawing!$D27:$E27),\"-\")","v":"-"},{"$f":"IF(Drawing!$Q27='Lookup Tables'!$M$3,COUNTA(Drawing!$N27:$O27),\"-\")","v":"-"},{"$f":"IF(Drawing!$G79='Lookup Tables'!$M$3,COUNTA(Drawing!$D79:$E79),\"-\")","v":"-"},{"$f":"IF(Drawing!$Q79='Lookup Tables'!$M$3,COUNTA(Drawing!$N79:$O79),\"-\")","v":"-"},null,{"$f":"IF(Drawing!$G27='Lookup Tables'!$R$3,COUNTA(Drawing!$D27:$E27),\"-\")","v":"-"},{"$f":"IF(Drawing!$Q27='Lookup Tables'!$R$3,COUNTA(Drawing!$N27:$O27),\"-\")","v":"-"},{"$f":"IF(Drawing!$G79='Lookup Tables'!$R$3,COUNTA(Drawing!$D79:$E79),\"-\")","v":"-"},{"$f":"IF(Drawing!$Q79='Lookup Tables'!$R$3,COUNTA(Drawing!$N79:$O79),\"-\")","v":"-"},null,{"$f":"IF(Drawing!$G27='Lookup Tables'!$K$12,COUNTA(Drawing!$D27:$E27),\"-\")","v":"-"},{"$f":"IF(Drawing!$Q27='Lookup Tables'!$K$12,COUNTA(Drawing!$N27:$O27),\"-\")","v":"-"},{"$f":"IF(Drawing!$G79='Lookup Tables'!$K$12,COUNTA(Drawing!$D79:$E79),\"-\")","v":"-"},{"$f":"IF(Drawing!$Q79='Lookup Tables'!$K$12,COUNTA(Drawing!$N79:$O79),\"-\")","v":"-"},null,{"$f":"IF(Drawing!$G27='Lookup Tables'!$K$11,COUNTA(Drawing!$D27:$E27),\"-\")","v":"-"},{"$f":"IF(Drawing!$Q27='Lookup Tables'!$K$11,COUNTA(Drawing!$N27:$O27),\"-\")","v":"-"},{"$f":"IF(Drawing!$G79='Lookup Tables'!$K$11,COUNTA(Drawing!$D79:$E79),\"-\")","v":"-"},{"$f":"IF(Drawing!$Q79='Lookup Tables'!$K$11,COUNTA(Drawing!$N79:$O79),\"-\")","v":"-"},null,{"$f":"IF(Drawing!$G27='Lookup Tables'!$K$20,COUNTA(Drawing!$D27:$E27),\"-\")","v":"-"},{"$f":"IF(Drawing!$Q27='Lookup Tables'!$K$20,COUNTA(Drawing!$N27:$O27),\"-\")","v":"-"},{"$f":"IF(Drawing!$G79='Lookup Tables'!$K$20,COUNTA(Drawing!$D79:$E79),\"-\")","v":"-"},{"$f":"IF(Drawing!$Q79='Lookup Tables'!$K$20,COUNTA(Drawing!$N79:$O79),\"-\")","v":"-"}]
[null,null,null,null,"Dia.",null,null,{"$f":"COUNTIF(Drawing!$D$25:$E$65,I8)+COUNTIF(Drawing!$N$25:$O$65,I8)+COUNTIF(Drawing!$D$77:$E$131,I8)+COUNTIF(Drawing!$N$77:$O$131,I8)","v":0},"E",null,"SINGLE HOLE",null,{"$f":"IF(Drawing!$G28='Lookup Tables'!$M$3,COUNTA(Drawing!$D28:$E28),\"-\")","v":"-"},{"$f":"IF(Drawing!$Q28='Lookup Tables'!$M$3,COUNTA(Drawing!$N28:$O28),\"-\")","v":"-"},{"$f":"IF(Drawing!$G80='Lookup Tables'!$M$3,COUNTA(Drawing!$D80:$E80),\"-\")","v":"-"},{"$f":"IF(Drawing!$Q80='Lookup Tables'!$M$3,COUNTA(Drawing!$N80:$O80),\"-\")","v":"-"},null,{"$f":"IF(Drawing!$G28='Lookup Tables'!$R$3,COUNTA(Drawing!$D28:$E28),\"-\")","v":"-"},{"$f":"IF(Drawing!$Q28='Lookup Tables'!$R$3,COUNTA(Drawing!$N28:$O28),\"-\")","v":"-"},{"$f":"IF(Drawing!$G80='Lookup Tables'!$R$3,COUNTA(Drawing!$D80:$E80),\"-\")","v":"-"},{"$f":"IF(Drawing!$Q80='Lookup Tables'!$R$3,COUNTA(Drawing!$N80:$O80),\"-\")","v":"-"},null,{"$f":"IF(Drawing!$G28='Lookup Tables'!$K$12,COUNTA(Drawing!$D28:$E28),\"-\")","v":"-"},{"$f":"IF(Drawing!$Q28='Lookup Tables'!$K$12,COUNTA(Drawing!$N28:$O28),\"-\")","v":"-"},{"$f":"IF(Drawing!$G80='Lookup Tables'!$K$12,COUNTA(Drawing!$D80:$E80),\"-\")","v":"-"},{"$f":"IF(Drawing!$Q80='Lookup Tables'!$K$12,COUNTA(Drawing!$N80:$O80),\"-\")","v":"-"},null,{"$f":"IF(Drawing!$G28='Lookup Tables'!$K$11,COUNTA(Drawing!$D28:$E28),\"-\")","v":"-"},{"$f":"IF(Drawing!$Q28='Lookup Tables'!$K$11,COUNTA(Drawing!$N28:$O28),\"-\")","v":"-"},{"$f":"IF(Drawing!$G80='Lookup Tables'!$K$11,COUNTA(Drawing!$D80:$E80),\"-\")","v":"-"},{"$f":"IF(Drawing!$Q80='Lookup Tables'!$K$11,COUNTA(Drawing!$N80:$O80),\"-\")","v":"-"},null,{"$f":"IF(Drawing!$G28='Lookup Tables'!$K$20,COUNTA(Drawing!$D28:$E28),\"-\")","v":"-"},{"$f":"IF(Drawing!$Q28='Lookup Tables'!$K$20,COUNTA(Drawing!$N28:$O28),\"-\")","v":"-"},{"$f":"IF(Drawing!$G80='Lookup Tables'!$K$20,COUNTA(Drawing!$D80:$E80),\"-\")","v":"-"},{"$f":"IF(Drawing!$Q80='Lookup Tables'!$K$20,COUNTA(Drawing!$N80:$O80),\"-\")","v":"-"}]
[null,"Pole Length","Depth",null,"19/32\"",null,null,{"$f":"COUNTIF(Drawing!$D$25:$E$65,I9)+COUNTIF(Drawing!$N$25:$O$65,I9)+COUNTIF(Drawing!$D$77:$E$131,I9)+COUNTIF(Drawing!$N$77:$O$131,I9)","v":0},"F",null,"JACKING HOLE",null,{"$f":"IF(Drawing!$G29='Lookup Tables'!$M$3,COUNTA(Drawing!$D29:$E29),\"-\")","v":"-"},{"$f":"IF(Drawing!$Q29='Lookup Tables'!$M$3,COUNTA(Drawing!$N29:$O29),\"-\")","v":"-"},{"$f":"IF(Drawing!$G81='Lookup Tables'!$M$3,COUNTA(Drawing!$D81:$E81),\"-\")","v":"-"},{"$f":"IF(Drawing!$Q81='Lookup Tables'!$M$3,COUNTA(Drawing!$N81:$O81),\"-\")","v":"-"},null,{"$f":"IF(Drawing!$G29='Lookup Tables'!$R$3,COUNTA(Drawing!$D29:$E29),\"-\")","v":"-"},{"$f":"IF(Drawing!$Q29='Lookup Tables'!$R$3,COUNTA(Drawing!$N29:$O29),\"-\")","v":"-"},{"$f":"IF(Drawing!$G81='Lookup Tables'!$R$3,COUNTA(Drawing!$D81:$E81),\"-\")","v":"-"},{"$f":"IF(Drawing!$Q81='Lookup Tables'!$R$3,COUNTA(Drawing!$N81:$O81),\"-\")","v":"-"},null,{"$f":"IF(Drawing!$G29='Lookup Tables'!$K$12,COUNTA(Drawing!$D29:$E29),\"-\")","v":"-"},{"$f":"IF(Drawing!$Q29='Lookup Tables'!$K$12,COUNTA(Drawing!$N29:$O29),\"-\")","v":"-"},{"$f":"IF(Drawing!$G81='Lookup Tables'!$K$12,COUNTA(Drawing!$D81:$E81),\"-\")","v":"-"},{"$f":"IF(Drawing!$Q81='Lookup Tables'!$K$12,COUNTA(Drawing!$N81:$O81),\"-\")","v":"-"},null,{"$f":"IF(Drawing!$G29='Lookup Tables'!$K$11,COUNTA(Drawing!$D29:$E29),\"-\")","v":"-"},{"$f":"IF(Drawing!$Q29='Lookup Tables'!$K$11,COUNTA(Drawing!$N29:$O29),\"-\")","v":"-"},{"$f":"IF(Drawing!$G81='Lookup Tables'!$K$11,COUNTA(Drawing!$D81:$E81),\"-\")","v":"-"},{"$f":"IF(Drawing!$Q81='Lookup Tables'!$K$11,COUNTA(Drawing!$N81:$O81),\"-\")","v":"-"},null,{"$f":"IF(Drawing!$G29='Lookup Tables'!$K$20,COUNTA(Drawing!$D29:$E29),\"-\")","v":"-"},{"$f":"IF(Drawing!$Q29='Lookup Tables'!$K$20,COUNTA(Drawing!$N29:$O29),\"-\")","v":"-"},{"$f":"IF(Drawing!$G81='Lookup Tables'!$K$20,COUNTA(Drawing!$D81:$E81),\"-\")","v":"-"},{"$f":"IF(Drawing!$Q81='Lookup Tables'!$K$20,COUNTA(Drawing!$N81:$O81),\"-\")","v":"-"}]
[null,"030",5.5,null,"27/64\"",null,null,{"$f":"COUNTIF(Drawing!$D$25:$E$65,I10)+COUNTIF(Drawing!$N$25:$O$65,I10)+COUNTIF(Drawing!$D$77:$E$131,I10)+COUNTIF(Drawing!$N$77:$O$131,I10)","v":0},"G",null,"GP 1/2\" TAP",null,{"$f":"IF(Drawing!$G30='Lookup Tables'!$M$3,COUNTA(Drawing!$D30:$E30),\"-\")","v":"-"},{"$f":"IF(Drawing!$Q30='Lookup Tables'!$M$3,COUNTA(Drawing!$N30:$O30),\"-\")","v":"-"},{"$f":"IF(Drawing!$G82='Lookup Tables'!$M$3,COUNTA(Drawing!$D82:$E82),\"-\")","v":"-"},{"$f":"IF(Drawing!$Q82='Lookup Tables'!$M$3,COUNTA(Drawing!$N82:$O82),\"-\")","v":"-"},null,{"$f":"IF(Drawing!$G30='Lookup Tables'!$R$3,COUNTA(Drawing!$D30:$E30),\"-\")","v":"-"},{"$f":"IF(Drawing!$Q30='Lookup Tables'!$R$3,COUNTA(Drawing!$N30:$O30),\"-\")","v":"-"},{"$f":"IF(Drawing!$G82='Lookup Tables'!$R$3,COUNTA(Drawing!$D82:$E82),\"-\")","v":"-"},{"$f":"IF(Drawing!$Q82='Lookup Tables'!$R$3,COUNTA(Drawing!$N82:$O82),\"-\")","v":"-"},null,{"$f":"IF(Drawing!$G30='Lookup Tables'!$K$12,COUNTA(Drawing!$D30:$E30),\"-\")","v":"-"},{"$f":"IF(Drawing!$Q30='Lookup Tables'!$K$12,COUNTA(Drawing!$N30:$O30),\"-\")","v":"-"},{"$f":"IF(Drawing!$G82='Lookup Tables'!$K$12,COUNTA(Drawing!$D82:$E82),\"-\")","v":"-"},{"$f":"IF(Drawing!$Q82='Lookup Tables'!$K$12,COUNTA(Drawing!$N82:$O82),\"-\")","v":"-"},null,{"$f":"IF(Drawing!$G30='Lookup Tables'!$K$11,COUNTA(Drawing!$D30:$E30),\"-\")","v":"-"},{"$f":"IF(Drawing!$Q30='Lookup Tables'!$K$11,COUNTA(Drawing!$N30:$O30),\"-\")","v":"-"},{"$f":"IF(Drawing!$G82='Lookup Tables'!$K$11,COUNTA(Drawing!$D82:$E82),\"-\")","v":"-"},{"$f":"IF(Drawing!$Q82='Lookup Tables'!$K$11,COUNTA(Drawing!$N82:$O82),\"-\")","v":"-"},null,{"$f":"IF(Drawing!$G30='Lookup Tables'!$K$20,COUNTA(Drawing!$D30:$E30),\"-\")","v":"-"},{"$f":"IF(Drawing!$Q30='Lookup Tables'!$K$20,COUNTA(Drawing!$N30:$O30),\"-\")","v":"-"},{"$f":"IF(Drawing!$G82='Lookup Tables'!$K$20,COUNTA(Drawing!$D82:$E82),\"-\")","v":"-"},{"$f":"IF(Drawing!$Q82='Lookup Tables'!$K$20,COUNTA(Drawing!$N82:$O82),\"-\")","v":"-"}]
{"$rows_left_out":362}
{"sheet":"Reference Table","index":4,"n_rows":29,"n_cols":18,"rows_kept":29,"cut":false,"hidden":false,"merged":[[0,12,0,13],[0,14,0,15],[0,16,0,17],[0,0,0,1],[0,2,0,3],[0,4,0,5],[0,6,0,7],[0,8,0,9],[0,10,0,11]]}
["Manufactoring Location",null,"Pole Class",null,"Pole Length",null,"Coating",null,"Cap",null,"# of holes",null,"1 pc/2 pc",null,"Add'l Permasafe",null,"Grounding Plates"]
["Location","Code","Class","Code","Length","Code","Coating Type","Code","Cap Type","Code","Range","Code","Type","Code","Type","Code","Type","Code"]
["Coshocton","C","C1","C1","030","030","Weathered","W","HDPE Flat","C","0-25",1,"No",1,"Standard",0,"No",0]
["Provo","P","C2","C2","035","035","Gray","G","Raptor","R","26-50",2,"Yes",2,"Additional","P","Yes","Z"]
[null,null,"C3","C3","040","040","Custom Color","C","Ductile","D","51-75",3]
[null,null,"H1","H1","045","045","Extreme Coat","X",null,null,"76-100",4]
[null,null,"H2","H2","050","050",null,null,null,null,"101+",5]
[null,null,"H3","H3","055","055"]
[null,null,"H4","H4","060","060"]
[null,null,"H5","H5","065","065"]
{"$rows_left_out":19}